{"text_format":"1","workbook":"xlsx","n_sheets":15,"sheets":["Dialog1","AMCA License Information","Optimize Size","Performance","PRVS Arr. 10","PRVS Arr. 4","Vibration isolators","Data","Data1","AMCA 207 Tables","FEI REG","FEI","loudness index","Sound calculation","Sound calculation-1"],"not_rendered":{"charts":1,"images":38,"macros":1,"external_links":2,"defined_names":9,"comments":0,"pivot_tables":0},"unopened":[{"sheet":"Dialog1","index":0,"reason":"not_a_worksheet"}],"bounds":{"document_bytes":16777216,"sheet_cells":100000,"rows_first":2000,"rows_last":500,"rows_between":2000,"halvings":0,"cell_chars":16384,"cell_head_chars":4096},"cells_cut":0,"cells_raw":0,"read":"whole","date_system":"1900"}

{"sheet":"AMCA License Information","index":1,"n_rows":23,"n_cols":5,"rows_kept":23,"cut":false,"hidden":false,"merged":[[1,4,1,10],[2,4,2,10],[3,4,3,10],[4,4,4,10],[10,4,10,10],[11,4,11,10],[12,4,12,10],[13,4,13,10],[5,4,5,9],[7,4,7,10],[8,4,8,10],[9,4,9,10],[18,4,18,10],[19,4,19,10],[14,4,14,10],[15,4,15,10],[16,4,16,8]]}
[]
[null,null,null,null,"M.K. Plastics Corporation certifies that the model shown herein "]
[null,null,null,null,"is licensed to bear the AMCA Seal. The ratings shown are based "]
[null,null,null,null,"on tests and procedures performed in accordance with AMCA "]
[null,null,null,null,"Publication 211 and AMCA Publication 311 and comply with the "]
[null,null,null,null,"requirements of the AMCA Certified Ratings Program."]
[]
[null,null,null,null,"Performance certified is for installation type D: ducted inlet,"]
{"$rows_left_out":16}
{"sheet":"Optimize Size","index":2,"n_rows":51,"n_cols":17,"rows_kept":51,"cut":false,"hidden":false,"merged":[[0,8,0,11],[17,1,17,7],[47,1,47,10],[48,1,48,10],[19,3,19,4],[20,3,20,4],[8,9,8,12],[9,9,9,12],[10,9,10,12],[49,1,49,12],[3,4,3,5],[4,4,4,5],[5,4,5,5],[6,4,6,5]]}
[null,null,null,null,null,null,null,null," "]
[null,null,null,null,null,null,null,null,null,null,null,null,null,null,null,null," "]
[]
[null,null,null,null,null,null,"."]
["Representative",null,null,null,null,null,"."]
[".",null,null,null,null,null,"."]
[".",null,null,null,null,null,".",null,null,null,null,"JOB # ","."]
[]
{"$rows_left_out":44}
{"sheet":"Performance","index":3,"n_rows":53,"n_cols":10,"rows_kept":53,"cut":false,"hidden":false,"merged":[[14,2,14,4],[15,2,15,4]]}
[null,null,null,null,null,null,null,"PRVS ",{"$f":"G10","v":125}]
[]
[]
[null,null,null,null,"Customer",{"$f":"'Optimize Size'!G4","v":"."}]
["Representative",null,null,null,"Project",{"$f":"'Optimize Size'!G5","v":"."}]
[{"$f":"'Optimize Size'!A6","v":"."},null,null,null,"Engineer",{"$f":"'Optimize Size'!G6","v":"."}]
[{"$f":"'Optimize Size'!A7","v":"."},null,null,null,"P.O. # ",{"$f":"'Optimize Size'!G7","v":"."},null,null,"JOB #",{"$f":"'Optimize Size'!M7","v":"."}]
[]
{"$rows_left_out":46}
{"sheet":"PRVS Arr. 10","index":4,"n_rows":53,"n_cols":11,"rows_kept":53,"cut":false,"hidden":false,"merged":[[52,6,52,7],[6,5,6,8],[1,8,1,9],[51,6,51,7]]}
[null,null,null,null,null,null,null,null,{"$f":"Performance!H1","v":"PRVS "},{"$f":"Performance!G10","v":125}]
[null,null,null,null,null,null,null,null,"      Technical Data"]
[]
[null,null,null,null,"Customer",{"$f":"Performance!F4","v":"."}]
[null,null,null,null,"Project",{"$f":"Performance!F5","v":"."}]
["Drawing",{"$f":"Performance!B14","v":"."},"B",null,"Engineer",{"$f":"Performance!F6","v":"."}]
["Revision",{"$f":"Performance!B15","v":"."},null,null,"P.O. # ",{"$f":"Performance!F7","v":"."},null,null,null,"JOB #",{"$f":"Performance!J7","v":"."}]
[]
{"$rows_left_out":46}
{"sheet":"PRVS Arr. 4","index":5,"n_rows":53,"n_cols":11,"rows_kept":53,"cut":false,"hidden":false,"merged":[[1,8,1,9],[6,5,6,8],[51,6,51,7],[52,6,52,7]]}
[null,null,null,null,null,null,null,null,{"$f":"Performance!H1","v":"PRVS "},{"$f":"Performance!G10","v":125}]
[null,null,null,null,null,null,null,null,"      Technical Data"]
[]
[null,null,null,null,"Customer",{"$f":"Performance!F4","v":"."}]
[null,null,null,null,"Project",{"$f":"Performance!F5","v":"."}]
["Drawing",{"$f":"Performance!B14","v":"."},"B",null,"Engineer",{"$f":"Performance!F6","v":"."}]
["Revision",{"$f":"Performance!B15","v":"."},null,null,"P.O. # ",{"$f":"Performance!F7","v":"."},null,null,null,"JOB #",{"$f":"Performance!J7","v":"."}]
[]
{"$rows_left_out":46}
{"sheet":"Vibration isolators","index":6,"n_rows":54,"n_cols":15,"rows_kept":54,"cut":false,"hidden":false,"merged":[[27,8,28,9],[29,8,29,9],[30,8,30,9],[31,8,31,9],[36,8,36,9],[32,8,32,9],[33,8,33,9],[34,8,34,9],[35,8,35,9]]}
[null,null,null,null,null,null,null,null,null,null,"Vibration isolators"]
[]
[]
[]
["Representative"]
[{"$f":"Performance!A6","v":"."},null,null,null,null,"Drawing",{"$f":"Performance!B14&\"C\"","v":".C"},null,"Sys. No.",{"$f":"Performance!B11","v":0},null,null,"JOB # ",{"$f":"Performance!J7","v":"."}]
[{"$f":"Performance!A7","v":"."},null,null,null,null,"Revision",{"$f":"Performance!B15","v":"."},null,null,{"$f":"Performance!B12","v":"."}]
[null,null,null,null,null,null,null,null,null,{"$f":"Performance!B13","v":"."}]
{"$rows_left_out":47}
{"sheet":"Data","index":7,"n_rows":169,"n_cols":43,"rows_kept":169,"cut":false,"hidden":true,"merged":[[18,18,18,21],[154,0,154,2],[3,13,3,22],[3,23,3,32],[3,33,3,42]]}
[null,null,null,null,null,null,null,null,null,null,null,null,null,null,"M.K. 2026 Version 14.1",null,null,null,null,null,null,"Copyright M.K. Plastics July 06, 2026"]
[null,null,null,null,null," DERIVED SPEEDS AND FAN SIZES",null,null,null,null,null,null,3,{"$f":"VLOOKUP(M2,L14:M19,2)","v":125}]
[null,{"$f":"VLOOKUP(Performance!G10,$M$14:$R$20,2)","v":2600},{"$f":"VLOOKUP(Performance!G10,$M$14:$R$20,3)","v":20.5},{"$f":"VLOOKUP(Performance!G10,$M$14:$R$20,5)","v":0.11},null,null,null,null,null,null,null,null,null,"Testing data by AMCA"]
[null,"No.","CFM","SP","BHP","No.","CFM","SP-CFM","BHP-CFM",null,null,null,null,"CFM",null,null,null,null,null,null,null,null,null,"SP",null,null,null,null,null,null,null,null,null,"BHP (Shaft Power)"]
[null,null,null,null,null,null,null,null,null,null,null,null,null,1,{"$f":"N5+1","v":2},{"$f":"O5+1","v":3},4,5,6,7,8,9,10,11,12,13,14,15,16,17,18,{"$f":"AE5+1","v":19},20,21,22,23,24,25,26,27,28,29,30]
[null,1,{"$f":"VLOOKUP(Performance!G10,$M$6:$AR$12,2)","v":924},{"$f":"VLOOKUP(Performance!G10,$M$6:$AR$12,12)","v":1E-3},{"$f":"VLOOKUP(Performance!G10,$M$6:$AR$12,22)","v":3.6055000000000001},1,{"$f":"C6*(Performance!G15/Data!$B$3)*(Performance!G11/Data!$C$3)^3","v":889.5276923076924},{"$f":"D6*(Performance!G15/Data!$B$3)^2*(Performance!G11/Data!$C$3)^2*($AB$17/$AB$19)","v":9.2580576684848166E-4},{"$f":"E6*(Performance!G15/Data!$B$3)^3*(Performance!G11/Data!$C$3)^5*($AB$17/$AB$19)","v":3.2134598880798535},null,null,null,63,221,199,183,155,138,125,102,71,33,0,5.0000000000000001E-3,2.3029999999999999,3.8610000000000002,6.3760000000000003,7.984,9.1509999999999998,10.813000000000001,12.426,13.452,13.458,1.173,1.129,1.0940000000000001,1.0369999999999999,0.99,0.96,0.89200000000000002,0.80200000000000005,0.64700000000000002,0.58299999999999996]
[null,2,{"$f":"VLOOKUP(Performance!G10,$M$6:$AR$12,3)","v":833},{"$f":"VLOOKUP(Performance!G10,$M$6:$AR$12,13)","v":3.3860000000000001},{"$f":"VLOOKUP(Performance!G10,$M$6:$AR$12,23)","v":3.2816999999999998},2,{"$f":"C7*(Performance!G15/Data!$B$3)*(Performance!G11/Data!$C$3)^3","v":801.92269230769239},{"$f":"D7*(Performance!G15/Data!$B$3)^2*(Performance!G11/Data!$C$3)^2*($AB$17/$AB$19)","v":3.1347783265489588},{"$f":"E7*(Performance!G15/Data!$B$3)^3*(Performance!G11/Data!$C$3)^5*($AB$17/$AB$19)","v":2.9248679280853294},null,null,null,90,332,297,259,222,187,150,112,74,46,0,3.0000000000000001E-3,2.0110000000000001,4.0960000000000001,6.0019999999999998,8.0020000000000007,9.8249999999999993,10.909000000000001,11.596,11.999000000000001,11.975,1.4686999999999999,1.3801000000000001,1.3028999999999999,1.2208000000000001,1.1463000000000001,1.0599000000000001,0.92935000000000001,0.80862000000000001,0.71372999999999998,0.61977000000000004]
[null,3,{"$f":"VLOOKUP(Performance!G10,$M$6:$AR$12,4)","v":744},{"$f":"VLOOKUP(Performance!G10,$M$6:$AR$12,14)","v":6.2190000000000003},{"$f":"VLOOKUP(Performance!G10,$M$6:$AR$12,24)","v":3.056},3,{"$f":"C8*(Performance!G15/Data!$B$3)*(Performance!G11/Data!$C$3)^3","v":716.24307692307696},{"$f":"D8*(Performance!G15/Data!$B$3)^2*(Performance!G11/Data!$C$3)^2*($AB$17/$AB$19)","v":5.7575860640307077},{"$f":"E8*(Performance!G15/Data!$B$3)^3*(Performance!G11/Data!$C$3)^5*($AB$17/$AB$19)","v":2.7237091715357185},null,null,null,125,924,833,744,653,560,463,374,281,155,0,1E-3,3.3860000000000001,6.2190000000000003,9.2349999999999994,11.911,14.180999999999999,15.391,15.981,15.92,15.042999999999999,3.6055000000000001,3.2816999999999998,3.056,2.8028,2.5240999999999998,2.2269000000000001,1.9064000000000001,1.5636000000000001,1.18,0.88409000000000004]
{"$rows_left_out":162}
{"sheet":"Data1","index":8,"n_rows":137,"n_cols":43,"rows_kept":137,"cut":false,"hidden":true,"merged":[[18,18,18,21],[3,13,3,22],[3,23,3,32],[3,33,3,42]]}
[]
[null,null,null,null,null," DERIVED SPEEDS AND FAN SIZES",null,null,null,null,null,null,6,{"$f":"VLOOKUP(M2,L14:M19,2)","v":250},{"$f":"CONCATENATE(\"PRVS \",N2)","v":"PRVS 250"},null,null,null,"M.K. 2026  Version 14.1",null,null,"Copyright M.K. Plastics July 06, 2026"]
[null,{"$f":"VLOOKUP($N$2,$M$14:$R$20,2)","v":2500},{"$f":"VLOOKUP($N$2,$M$14:$R$20,3)","v":20.5},{"$f":"VLOOKUP($N$2,$M$14:$R$20,5)","v":0.47899999999999998},null,null,{"$f":"N2","v":250},{"$f":"VLOOKUP(G3,M14:Q19,3)","v":20.5},1222]
[null,"No.","CFM","SP","BHP","No.","CFM","SP-CFM","BHP-CFM",null,null,null,null,"CFM",null,null,null,null,null,null,null,null,null,"SP",null,null,null,null,null,null,null,null,null,"BHP"]
[null,null,null,null,null,null,null,null,null,null,null,null,null,1,{"$f":"N5+1","v":2},3,4,5,6,7,8,9,10,11,12,13,14,15,16,17,18,19,20,21,22,23,24,25,26,27,28,29,30]
[null,1,{"$f":"VLOOKUP($N$2,$M$6:$AR$12,2)","v":3237},{"$f":"VLOOKUP($N$2,$M$6:$AR$12,12)","v":2E-3},{"$f":"VLOOKUP($N$2,$M$6:$AR$12,22)","v":9.968},1,{"$f":"C6*($I$3/$B$3)*($H$3/$C$3)^3","v":1582.2456},{"$f":"D6*($I$3/$B$3)^2*($H$3/$C$3)^2*($AB$17/$AB$19)","v":4.7735037550431669E-4},{"$f":"E6*($I$3/$B$3)^3*($H$3/$C$3)^5*($AB$17/$AB$19)","v":1.1629110559158058},null,null,null,63,221,199,183,155,138,125,102,71,33,0,5.0000000000000001E-3,2.3029999999999999,3.8610000000000002,6.3760000000000003,7.984,9.1509999999999998,10.813000000000001,12.426,13.452,13.458,1.173,1.129,1.0940000000000001,1.0369999999999999,1.0109999999999999,0.996,0.89200000000000002,0.80200000000000005,0.64700000000000002,0.58299999999999996]
[null,2,{"$f":"VLOOKUP($N$2,$M$6:$AR$12,3)","v":2940},{"$f":"VLOOKUP($N$2,$M$6:$AR$12,13)","v":3.1059999999999999},{"$f":"VLOOKUP($N$2,$M$6:$AR$12,23)","v":9.3629999999999995},2,1437.0720000000001,0.7413251331582037,1.0923290746929863,null,null,null,90,332,297,259,222,187,150,112,74,46,0,3.0000000000000001E-3,2.0110000000000001,4.0960000000000001,6.0019999999999998,8.0020000000000007,9.8249999999999993,10.909000000000001,11.596,11.999000000000001,11.975,1.4686999999999999,1.3801000000000001,1.3028999999999999,1.2208000000000001,1.1463000000000001,1.0599000000000001,0.92935000000000001,0.80862000000000001,0.71372999999999998,0.61977000000000004]
[null,3,{"$f":"VLOOKUP($N$2,$M$6:$AR$12,4)","v":2616},{"$f":"VLOOKUP($N$2,$M$6:$AR$12,14)","v":5.9690000000000003},{"$f":"VLOOKUP($N$2,$M$6:$AR$12,24)","v":8.641},3,1278.7008000000001,1.424652195692633,1.0080973549526964,null,null,null,125,924,833,744,653,560,463,374,281,155,0,1E-3,3.3860000000000001,6.2190000000000003,9.2349999999999994,11.911,14.180999999999999,15.391,15.981,15.92,15.042999999999999,3.6055000000000001,3.2816999999999998,3.056,2.8028,2.5240999999999998,2.2269000000000001,1.9064000000000001,1.5636000000000001,1.18,0.88409000000000004]
{"$rows_left_out":130}
{"sheet":"AMCA 207 Tables","index":9,"n_rows":481,"n_cols":13,"rows_kept":481,"cut":false,"hidden":true,"merged":[[339,1,339,4],[447,0,447,3],[448,1,448,3],[362,0,362,4],[363,1,363,4],[387,0,387,4],[388,1,388,4],[417,0,417,4],[418,1,418,4],[306,0,307,2],[308,0,308,2],[309,1,309,2],[337,0,337,4],[338,0,338,4],[273,0,273,12],[274,0,275,0],[274,1,274,3],[274,4,274,5],[274,6,274,8],[274,9,274,11],[183,0,183,3],[211,0,211,3],[244,0,244,12],[245,0,246,0],[245,1,245,3],[245,4,245,6],[245,7,245,9],[245,10,245,12],[149,0,149,12],[150,0,151,0],[150,1,150,3],[150,4,150,6],[150,7,150,9],[150,10,150,12],[121,0,122,0],[121,1,121,3],[121,4,121,6],[121,7,121,9],[121,10,121,12],[91,0,92,0],[91,1,91,3],[91,4,91,6],[91,7,91,9],[120,0,120,12],[59,0,61,0],[59,1,59,3],[59,4,59,6],[59,7,59,9],[90,0,90,9],[0,0,0,4],[1,1,1,4],[29,0,29,4],[30,1,30,4],[58,0,58,9]]}
["Table A1.  EISA 2007 Nominal Motor Effciency"]
["Motor Power (hp)","ODP"]
[null,2,4,6,8]
[1,0.77,0.85499999999999998,0.82499999999999996,0.755]
[1.5,0.84,0.86499999999999999,0.86499999999999999,0.77]
[2,0.85499999999999998,0.86499999999999999,0.875,0.86499999999999999]
[3,0.85499999999999998,0.89500000000000002,0.88500000000000001,0.875]
[5,0.86499999999999999,0.89500000000000002,0.89500000000000002,0.88500000000000001]
{"$rows_left_out":474}
{"sheet":"FEI REG","index":10,"n_rows":33,"n_cols":27,"rows_kept":33,"cut":false,"hidden":true,"merged":[[21,11,21,12],[27,11,27,12],[8,16,8,26],[9,3,10,5],[9,6,10,11],[9,12,9,15],[9,18,9,26],[10,12,10,15],[10,18,10,26]]}
["FEI Calculations per AMCA 208"]
[]
[" "]
[" "]
[]
["Only TEFC motors are considered."]
[" "]
["Assumption: VFD capacity is same as motor capacity"]
{"$rows_left_out":26}
{"sheet":"FEI","index":11,"n_rows":27,"n_cols":20,"rows_kept":27,"cut":false,"hidden":true,"merged":[[1,11,1,12],[7,11,7,12],[14,6,14,7],[14,8,14,9]]}
[]
[null,null,null,null,null,null,null,null,null,null,null,"FEPref Constants, section 5.2"]
[null,null,null,null,null,null,null,null,null,null,null,"Q0",250]
[null,null,null,null,null,null,null,null,null,null,null,"P0",0.4]
[null,null,null,null,null,null,null,null,null,null,null,"η0,Total",0.66]
[null,null,null,null,null,null,null,null,null,null,null,"η0,Static",0.6]
[]
[null,null,null,null," ",null,null,null,null,null,null,"Ref Mtr Constants, section 5.2"]
{"$rows_left_out":20}
{"sheet":"loudness index","index":12,"n_rows":114,"n_cols":18,"rows_kept":114,"cut":false,"hidden":true,"merged":[]}
[]
[null,null,"Loudness Index s (ANSI S3.4-1980)"]
[null,1,2,3,4,5,6,7,8,null,1,2,3,4,5,6,7,8]
["Lp",63,125,250,500,1000,2000,4000,8000,null,63,125,250,500,1000,2000,4000,8000]
[11,0,0,0,0,0,0,0,0.18,"Lwmo",{"$f":"Data1!K31","v":90.380880952797398},{"$f":"Data1!L31","v":93.14017651410343},{"$f":"Data1!M31","v":96.470753660576548},{"$f":"Data1!N31","v":90.429185171745175},{"$f":"Data1!O31","v":82.843438907973834},{"$f":"Data1!P31","v":77.835144180668749},{"$f":"Data1!Q31","v":73.4551896754528},{"$f":"Data1!R31","v":69.37242654387245}]
[{"$f":"A5+1","v":12},0,0,0,0,0,0,0.1,0.22,"Lp",{"$f":"(K5-K$16-11.5)","v":78.880880952797398},{"$f":"(L5-L$16-11.5)","v":81.64017651410343},84.970753660576548,78.929185171745175,71.343438907973834,66.335144180668749,61.9551896754528,57.87242654387245]
[13,0,0,0,0,0,0,0.14000000000000001,0.26,"Lp-0.5",{"$f":"K6-0.4","v":78.480880952797392},81.240176514103425,84.570753660576543,78.529185171745169,70.943438907973828,65.935144180668743,61.555189675452802,57.472426543872452]
[14,0,0,0,0,0,0,0.18,0.3,"S1-8(1)",{"$f":"VLOOKUP(K7,A5:I114,2)","v":5.8},{"$f":"VLOOKUP(L7,A3:I114,3)","v":9.9},{"$f":"VLOOKUP(M7,A5:I114,4)","v":14.4},{"$f":"VLOOKUP(N7,A5:I114,5)","v":11.8},{"$f":"VLOOKUP(O7,A5:I114,6)","v":8.8000000000000007},{"$f":"VLOOKUP(P7,A5:I114,7)","v":7.8},{"$f":"VLOOKUP(Q7,A5:I114,8)","v":7.4},{"$f":"VLOOKUP(R7,A5:I114,9)","v":7}]
{"$rows_left_out":107}
{"sheet":"Sound calculation","index":13,"n_rows":57,"n_cols":225,"rows_kept":57,"cut":false,"hidden":true,"merged":[[22,25,22,32]]}
[]
[null,null,"RPM",null,null,"SP",null,null,"SP"]
["Size",{"$f":"Performance!G10","v":125},{"$f":"VLOOKUP($B$3,$A$52:$I$71,2)","v":1600},{"$f":"IF(C3-$B$4<=0,C3-$B$4,-10000)","v":-903},{"$f":"IF(C3-$B$4>0,C3-$B$4,10000)","v":10000},{"$f":"VLOOKUP($D$12,$E$15:$H$22,2)","v":0.25},{"$f":"IF(F3-$B$5<=0,F3-$B$5,-10000)","v":-2.694},{"$f":"IF(F3-$B$5>0,F3-$B$5,10000)","v":10000},{"$f":"VLOOKUP($E$12,$E$15:$H$22,2)","v":0.25},{"$f":"IF(I3-$B$5<=0,I3-$B$5,-10000)","v":-2.694},{"$f":"IF(I3-$B$5>0,I3-$B$5,10000)","v":10000},null,{"$f":"G8","v":7},{"$f":"G7","v":0.25},{"$f":"VLOOKUP($M$3,$N$14:$V$37,2)","v":118.95388637030739},{"$f":"VLOOKUP($M$3,$N$14:$V$37,3)","v":95.803585911469227},{"$f":"VLOOKUP($M$3,$N$14:$V$37,4)","v":92.273094515800267},{"$f":"VLOOKUP($M$3,$N$14:$V$37,5)","v":103.73489129233052},{"$f":"VLOOKUP($M$3,$N$14:$V$37,6)","v":88.720774741250708},{"$f":"VLOOKUP($M$3,$N$14:$V$37,7)","v":81.314265741203656},{"$f":"VLOOKUP($M$3,$N$14:$V$37,8)","v":77.486523885017732},{"$f":"VLOOKUP($M$3,$N$14:$V$37,9)","v":72.786523885017729}]
["RPM",{"$f":"Performance!G15","v":2503},{"$f":"VLOOKUP($B$3,$A$52:$I$71,3)","v":2000},-503,10000,{"$f":"VLOOKUP($D$12,$E$15:$H$22,3)","v":6.5},{"$f":"IF(F4-$B$5<=0,F4-$B$5,-10000)","v":-10000},{"$f":"IF(F4-$B$5>0,F4-$B$5,10000)","v":3.556},{"$f":"VLOOKUP($E$12,$E$15:$H$22,3)","v":7.5},{"$f":"IF(I4-$B$5<=0,I4-$B$5,-10000)","v":-10000},{"$f":"IF(I4-$B$5>0,I4-$B$5,10000)","v":4.556},null,{"$f":"H8","v":8},{"$f":"H7","v":6.5},{"$f":"VLOOKUP($M$4,$N$14:$V$37,2)","v":118.20683734350366},{"$f":"VLOOKUP($M$4,$N$14:$V$37,3)","v":94.8189368873294},{"$f":"VLOOKUP($M$4,$N$14:$V$37,4)","v":91.26720194848896},{"$f":"VLOOKUP($M$4,$N$14:$V$37,5)","v":111.57595994967956},{"$f":"VLOOKUP($M$4,$N$14:$V$37,6)","v":86.758847611416996},{"$f":"VLOOKUP($M$4,$N$14:$V$37,7)","v":79.461047827146302},{"$f":"VLOOKUP($M$4,$N$14:$V$37,8)","v":75.313471305798231},{"$f":"VLOOKUP($M$4,$N$14:$V$37,9)","v":70.41347130579824}]
["SP",{"$f":"Performance!G13","v":2.944},{"$f":"VLOOKUP($B$3,$A$52:$I$71,4)","v":2400},-103,10000,{"$f":"VLOOKUP($D$12,$E$15:$H$22,4)","v":9},{"$f":"IF(F5-$B$5<=0,F5-$B$5,-10000)","v":-10000},{"$f":"IF(F5-$B$5>0,F5-$B$5,10000)","v":6.056},{"$f":"VLOOKUP($E$12,$E$15:$H$22,4)","v":12},{"$f":"IF(I5-$B$5<=0,I5-$B$5,-10000)","v":-10000},{"$f":"IF(I5-$B$5>0,I5-$B$5,10000)","v":9.0560000000000009},null,null,{"$f":"IF(B5<=F3,F3,IF(B5>G29,G29,B5))","v":2.944},{"$f":"IF((O3-O4)<=0,O3+($N$5-$N$3)*(O4-O3)/($N$4-$N$3),O4+($N$4-$N$5)*(O3-O4)/($N$4-$N$3))","v":118.63187835779391},95.379162796103998,91.839514583586407,107.11470552639425,87.87510567120718,80.515454691528376,76.549851301270962,71.76364330127096]
[null,null,{"$f":"VLOOKUP($B$3,$A$52:$I$71,5)","v":2600},-10000,97,null,{"$f":"MAX(G3:G5)","v":-2.694},{"$f":"MIN(H3:H5)","v":3.556},null,{"$f":"MAX(J3:J5)","v":-2.694},{"$f":"MIN(K3:K5)","v":4.556},null,{"$f":"J8","v":10},{"$f":"J7","v":0.25},{"$f":"VLOOKUP($M$6,$N$14:$V$37,2)","v":122.15166696493901},{"$f":"VLOOKUP($M$6,$N$14:$V$37,3)","v":99.164191219196425},{"$f":"VLOOKUP($M$6,$N$14:$V$37,4)","v":93.579539704734515},{"$f":"VLOOKUP($M$6,$N$14:$V$37,5)","v":105.50103419411056},{"$f":"VLOOKUP($M$6,$N$14:$V$37,6)","v":91.745434295627533},{"$f":"VLOOKUP($M$6,$N$14:$V$37,7)","v":83.735126699114048},{"$f":"VLOOKUP($M$6,$N$14:$V$37,8)","v":79.738960842332389},{"$f":"VLOOKUP($M$6,$N$14:$V$37,9)","v":75.09156076571557}]
[null,null,{"$f":"VLOOKUP($B$3,$A$52:$I$71,6)","v":2800},-10000,297,null,{"$f":"IF(B5<=F3,F3,IF(B5>=G29,G30,$B$5+G6))","v":0.25},{"$f":"IF($B$5+H6<=F3,F4,IF($B$5+H6>=G29,G29,$B$5+H6))","v":6.5},null,{"$f":"IF(B5<=I3,I3,IF(B5>=J29,J30,$B$5+J6))","v":0.25},{"$f":"IF($B$5+K6<=I3,I4,IF($B$5+K6>=J29,J29,$B$5+K6))","v":7.5},null,{"$f":"K8","v":11},{"$f":"K7","v":7.5},{"$f":"VLOOKUP($M$7,$N$14:$V$37,2)","v":121.44298281201577},{"$f":"VLOOKUP($M$7,$N$14:$V$37,3)","v":98.291372528933564},{"$f":"VLOOKUP($M$7,$N$14:$V$37,4)","v":92.389411701249102},{"$f":"VLOOKUP($M$7,$N$14:$V$37,5)","v":113.11579754806581},{"$f":"VLOOKUP($M$7,$N$14:$V$37,6)","v":89.934299025522549},{"$f":"VLOOKUP($M$7,$N$14:$V$37,7)","v":81.863032055027119},{"$f":"VLOOKUP($M$7,$N$14:$V$37,8)","v":77.572609731528644},{"$f":"VLOOKUP($M$7,$N$14:$V$37,9)","v":72.717414984116516}]
[null,null,{"$f":"VLOOKUP($B$3,$A$52:$I$71,7)","v":3000},-10000,497,null,{"$f":"VLOOKUP($G$7,$G$10:$H$12,2)","v":7},{"$f":"VLOOKUP($H$7,$G$10:$H$12,2)","v":8},null,{"$f":"VLOOKUP($J$7,$J$10:$K$12,2)","v":10},{"$f":"VLOOKUP($K$7,$J$10:$K$12,2)","v":11},null,null,{"$f":"IF(B5<=I3,I3,IF(B5>J29,J29,B5))","v":2.944},{"$f":"IF((O6-O7)<=0,O6+($N$8-$N$6)*(O7-O6)/($N$7-$N$6),O7+($N$7-$N$8)*(O6-O7)/($N$7-$N$6))","v":121.88832970866657},98.839863832773233,93.13730455419801,108.33057522522165,91.07244141043266,83.039482151366443,78.933974650262698,74.209360940111722]
{"$rows_left_out":50}
{"sheet":"Sound calculation-1","index":14,"n_rows":65,"n_cols":225,"rows_kept":65,"cut":false,"hidden":true,"merged":[[23,25,23,32]]}
[]
[null,null,"RPM",null,null,"SP",null,null,"SP"]
["Size",{"$f":"Data1!N2","v":250},{"$f":"VLOOKUP($B$3,$A$52:$I$71,2)","v":1600},{"$f":"IF(C3-$B$4<=0,C3-$B$4,-10000)","v":-10000},{"$f":"IF(C3-$B$4>0,C3-$B$4,10000)","v":378},{"$f":"VLOOKUP($D$12,$E$15:$H$22,2)","v":0.25},{"$f":"IF(F3-$B$5<=0,F3-$B$5,-10000)","v":-2.694},{"$f":"IF(F3-$B$5>0,F3-$B$5,10000)","v":10000},{"$f":"VLOOKUP($E$12,$E$15:$H$22,2)","v":0.25},{"$f":"IF(I3-$B$5<=0,I3-$B$5,-10000)","v":-2.694},{"$f":"IF(I3-$B$5>0,I3-$B$5,10000)","v":10000},null,{"$f":"G8","v":2},{"$f":"G7","v":2.75},{"$f":"VLOOKUP($M$3,$N$14:$V$37,2)","v":90.437576201471472},{"$f":"VLOOKUP($M$3,$N$14:$V$37,3)","v":93.411060708515834},{"$f":"VLOOKUP($M$3,$N$14:$V$37,4)","v":96.991708305364071},{"$f":"VLOOKUP($M$3,$N$14:$V$37,5)","v":90.821630677169438},{"$f":"VLOOKUP($M$3,$N$14:$V$37,6)","v":83.128594051291202},{"$f":"VLOOKUP($M$3,$N$14:$V$37,7)","v":78.054316768763812},{"$f":"VLOOKUP($M$3,$N$14:$V$37,8)","v":73.698174385443139},{"$f":"VLOOKUP($M$3,$N$14:$V$37,9)","v":69.698175272741665}]
["RPM",{"$f":"Data1!I3","v":1222},{"$f":"VLOOKUP($B$3,$A$52:$I$71,3)","v":2000},-10000,778,{"$f":"VLOOKUP($D$12,$E$15:$H$22,3)","v":2.75},{"$f":"IF(F4-$B$5<=0,F4-$B$5,-10000)","v":-0.19399999999999995},{"$f":"IF(F4-$B$5>0,F4-$B$5,10000)","v":10000},{"$f":"VLOOKUP($E$12,$E$15:$H$22,3)","v":4.75},{"$f":"IF(I4-$B$5<=0,I4-$B$5,-10000)","v":-10000},{"$f":"IF(I4-$B$5>0,I4-$B$5,10000)","v":1.806},null,{"$f":"H8","v":3},{"$f":"H7","v":4.5},{"$f":"VLOOKUP($M$4,$N$14:$V$37,2)","v":89.926149989205385},{"$f":"VLOOKUP($M$4,$N$14:$V$37,3)","v":90.967517717682313},{"$f":"VLOOKUP($M$4,$N$14:$V$37,4)","v":92.292375169394134},{"$f":"VLOOKUP($M$4,$N$14:$V$37,5)","v":87.28152946844537},{"$f":"VLOOKUP($M$4,$N$14:$V$37,6)","v":80.556318273943816},{"$f":"VLOOKUP($M$4,$N$14:$V$37,7)","v":76.077244453473241},{"$f":"VLOOKUP($M$4,$N$14:$V$37,8)","v":71.506302001509624},{"$f":"VLOOKUP($M$4,$N$14:$V$37,9)","v":66.759720244282235}]
["SP",{"$f":"Data1!D17","v":2.944},{"$f":"VLOOKUP($B$3,$A$52:$I$71,4)","v":2400},-10000,1178,{"$f":"VLOOKUP($D$12,$E$15:$H$22,4)","v":4.5},{"$f":"IF(F5-$B$5<=0,F5-$B$5,-10000)","v":-10000},{"$f":"IF(F5-$B$5>0,F5-$B$5,10000)","v":1.556},{"$f":"VLOOKUP($E$12,$E$15:$H$22,4)","v":7},{"$f":"IF(I5-$B$5<=0,I5-$B$5,-10000)","v":-10000},{"$f":"IF(I5-$B$5>0,I5-$B$5,10000)","v":4.056},null,null,{"$f":"IF(B5<=F3,F3,IF(B5>G29,G29,B5))","v":2.944},{"$f":"IF((O3-O4)<=0,O3+($N$5-$N$3)*(O4-O3)/($N$4-$N$3),O4+($N$4-$N$5)*(O3-O4)/($N$4-$N$3))","v":90.380880952797398},93.14017651410343,96.470753660576548,90.429185171745175,82.843438907973834,77.835144180668749,73.4551896754528,69.37242654387245]
[null,null,{"$f":"VLOOKUP($B$3,$A$52:$I$71,5)","v":2600},-10000,1378,null,{"$f":"MAX(G3:G5)","v":-0.19399999999999995},{"$f":"MIN(H3:H5)","v":1.556},null,{"$f":"MAX(J3:J5)","v":-2.694},{"$f":"MIN(K3:K5)","v":1.806},null,{"$f":"J8","v":4},{"$f":"J7","v":0.25},{"$f":"VLOOKUP($M$6,$N$14:$V$37,2)","v":97.599264096424307},{"$f":"VLOOKUP($M$6,$N$14:$V$37,3)","v":99.995799886232149},{"$f":"VLOOKUP($M$6,$N$14:$V$37,4)","v":104.30502219211584},{"$f":"VLOOKUP($M$6,$N$14:$V$37,5)","v":104.20221436601472},{"$f":"VLOOKUP($M$6,$N$14:$V$37,6)","v":94.007498304764127},{"$f":"VLOOKUP($M$6,$N$14:$V$37,7)","v":88.349544345970827},{"$f":"VLOOKUP($M$6,$N$14:$V$37,8)","v":83.671478366331343},{"$f":"VLOOKUP($M$6,$N$14:$V$37,9)","v":79.671478640353968}]
[null,null,{"$f":"VLOOKUP($B$3,$A$52:$I$71,6)","v":2800},-10000,1578,null,{"$f":"IF(B5<=F3,F3,IF(B5>=G29,G30,$B$5+G6))","v":2.75},{"$f":"IF($B$5+H6<=F3,F4,IF($B$5+H6>=G29,G29,$B$5+H6))","v":4.5},null,{"$f":"IF(B5<=I3,I3,IF(B5>=J29,J30,$B$5+J6))","v":0.25},{"$f":"IF($B$5+K6<=I3,I4,IF($B$5+K6>=J29,J29,$B$5+K6))","v":4.75},null,{"$f":"K8","v":5},{"$f":"K7","v":4.75},{"$f":"VLOOKUP($M$7,$N$14:$V$37,2)","v":93.785368513271536},{"$f":"VLOOKUP($M$7,$N$14:$V$37,3)","v":97.075333105569612},{"$f":"VLOOKUP($M$7,$N$14:$V$37,4)","v":99.715189245457708},{"$f":"VLOOKUP($M$7,$N$14:$V$37,5)","v":98.427368646677252},{"$f":"VLOOKUP($M$7,$N$14:$V$37,6)","v":89.056336800972318},{"$f":"VLOOKUP($M$7,$N$14:$V$37,7)","v":83.978450595970827},{"$f":"VLOOKUP($M$7,$N$14:$V$37,8)","v":79.300384616331343},{"$f":"VLOOKUP($M$7,$N$14:$V$37,9)","v":75.300383258676817}]
[null,null,{"$f":"VLOOKUP($B$3,$A$52:$I$71,7)","v":3000},-10000,1778,null,{"$f":"VLOOKUP($G$7,$G$10:$H$12,2)","v":2},{"$f":"VLOOKUP($H$7,$G$10:$H$12,2)","v":3},null,{"$f":"VLOOKUP($J$7,$J$10:$K$12,2)","v":4},{"$f":"VLOOKUP($K$7,$J$10:$K$12,2)","v":5},null,null,{"$f":"IF(B5<=I3,I3,IF(B5>J29,J29,B5))","v":2.944},{"$f":"IF((O6-O7)<=0,O6+($N$8-$N$6)*(O7-O6)/($N$7-$N$6),O7+($N$7-$N$8)*(O6-O7)/($N$7-$N$6))","v":95.31601194064352},98.247413773542178,101.55724220138318,100.74500672870468,91.043402951160758,85.732716220970829,81.054650241331345,77.05464953852325]
{"$rows_left_out":57}